Reaction Details
TargetMonocarboxylate transporter 1
LigandBDBM50103571
Substrate/Competitorn/a
Meas. Tech.ChEMBL_1435611 (CHEMBL3386534)
Kd 1.6±n/a nM
Citation Granchi, CFancelli, DMinutolo, F An update on therapeutic opportunities offered by cancer glycolytic metabolism. Bioorg Med Chem Lett24:4915-25 (2014) 
 
Monocarboxylate transporter 1
Name:Monocarboxylate transporter 1
Type:PROTEIN
Mol. Mass.:53956.64
Organism:Homo sapiens (Human)
Description:ChEMBL_1451367
Residue:500
BDBM50103571
NameBDBM50103571
Synonyms:CHEMBL3335793
TypeSmall organic molecule
Emp. Form.C21H24F3N5O5S
Mol. Mass.515.506
SMILESCC(C)n1c2sc(Cc3c(C)[nH]nc3C(F)(F)F)c(C(=O)N3C[C@](C)(O)CO3)c2c(=O)n(C)c1=O