Reaction Details
TargetSodium channel protein type 9 subunit alpha
LigandBDBM50103575
Substrate/Competitorn/a
Meas. Tech.ChEMBL_1435612 (CHEMBL3386535)
IC50 9.0±n/a nM
Citation Yang, SWHo, GDTulshian, DBercovici, ATan, ZHanisak, JBrumfield, SMatasi, JSun, XSakwa, SAHerr, RJZhou, XBridal, TUrban, MVivian, JRindgen, DSorota, S Bioavailable pyrrolo-benzo-1,4-diazines as Na(v)1.7 sodium channel blockers for the treatment of pain. Bioorg Med Chem Lett24:4958-62 (2014) 
 
Sodium channel protein type 9 subunit alpha
Name:Sodium channel protein type 9 subunit alpha
Type:Protein
Mol. Mass.:226375.97
Organism:Homo sapiens (Human)
Description:Q15858
Residue:1988
BDBM50103575
NameBDBM50103575
Synonyms:CHEMBL3337585
TypeSmall organic molecule
Emp. Form.C26H27F3N4O2
Mol. Mass.484.5134
SMILESCOc1ccc(cc1N(C)C)C(=O)N1CCC2(CC1)Nc1cc(ccc1-n1cccc21)C(F)(F)F