Reaction Details
TargetSodium channel protein type 9 subunit alpha
LigandBDBM50103589
Substrate/Competitorn/a
Meas. Tech.ChEMBL_1435612 (CHEMBL3386535)
IC50 41±n/a nM
Citation Yang, SWHo, GDTulshian, DBercovici, ATan, ZHanisak, JBrumfield, SMatasi, JSun, XSakwa, SAHerr, RJZhou, XBridal, TUrban, MVivian, JRindgen, DSorota, S Bioavailable pyrrolo-benzo-1,4-diazines as Na(v)1.7 sodium channel blockers for the treatment of pain. Bioorg Med Chem Lett24:4958-62 (2014) 
 
Sodium channel protein type 9 subunit alpha
Name:Sodium channel protein type 9 subunit alpha
Type:Protein
Mol. Mass.:226375.97
Organism:Homo sapiens (Human)
Description:Q15858
Residue:1988
BDBM50103589
NameBDBM50103589
Synonyms:CHEMBL3337599
TypeSmall organic molecule
Emp. Form.C26H24N4O2
Mol. Mass.424.4944
SMILESCOc1ccc-2c(NC3(CCN(CC3)C(=O)c3ccc4ccccc4n3)c3cccn-23)c1