Reaction Details
TargetHistone deacetylase 1
LigandBDBM29589
Substrate/Competitorn/a
Meas. Tech.ChEMBL_1484268 (CHEMBL3538484)
IC50 2.5±n/a nM
Citation Fredenhagen, AKittelmann, MOberer, LKuhn, AKühnöl, JDélémonté, TAichholz, RWang, PAtadja, PShultz, MD Biocatalytic synthesis and structure elucidation of cyclized metabolites of the deacetylase inhibitor panobinostat (LBH589). Drug Metab Dispos40:1041-50 (2012) 
 
Histone deacetylase 1
Name:Histone deacetylase 1
Type:Enzyme
Mol. Mass.:55090.27
Organism:Homo sapiens (Human)
Description:Q13547
Residue:482
BDBM29589
NameBDBM29589
Synonyms:Faridak LBH-589B US10722597, Compound Panobinostat
TypeSmall organic molecule
Emp. Form.C21H23N3O2
Mol. Mass.349.4262
SMILESCc1[nH]c2ccccc2c1CCNCc1ccc(\C=C\C(=O)NO)cc1