Reaction Details
TargetAlpha-1B adrenergic receptor
LigandBDBM50103888
Substrate/Competitorn/a
Meas. Tech.ChEMBL_1436285 (CHEMBL3387785)
Ki 50±n/a nM
Citation Chen, JCampbell, APUrmi, KFWakelin, LPDenny, WAGriffith, RFinch, AM Human alpha1-adrenoceptor subtype selectivity of substituted homobivalent 4-aminoquinolines. Bioorg Med Chem22:5910-6 (2014) 
 
Alpha-1B adrenergic receptor
Name:Alpha-1B adrenergic receptor
Type:Enzyme
Mol. Mass.:56862.13
Organism:Homo sapiens (Human)
Description:P35368
Residue:520
BDBM50103888
NameBDBM50103888
Synonyms:CHEMBL3343978
TypeSmall organic molecule
Emp. Form.C22H22N4O2
Mol. Mass.374.4357
SMILESCOc1ccc2c(NCCNc3ccnc4cc(OC)ccc34)ccnc2c1