Reaction Details
TargetAlpha-1A adrenergic receptor
LigandBDBM50103896
Substrate/Competitorn/a
Meas. Tech.ChEMBL_1436282 (CHEMBL3387782)
Ki 26±n/a nM
Citation Chen, JCampbell, APUrmi, KFWakelin, LPDenny, WAGriffith, RFinch, AM Human alpha1-adrenoceptor subtype selectivity of substituted homobivalent 4-aminoquinolines. Bioorg Med Chem22:5910-6 (2014) 
 
Alpha-1A adrenergic receptor
Name:Alpha-1A adrenergic receptor
Type:Cell-surface receptors
Mol. Mass.:51511.67
Organism:Homo sapiens (Human)
Description:P35348
Residue:466
BDBM50103896
NameBDBM50103896
Synonyms:CHEMBL3343975
TypeSmall organic molecule
Emp. Form.C20H18N4
Mol. Mass.314.3837
SMILESC(CNc1ccnc2ccccc12)Nc1ccnc2ccccc12