Reaction Details
TargetAlpha-1A adrenergic receptor
LigandBDBM50103888
Substrate/Competitorn/a
Meas. Tech.ChEMBL_1436282 (CHEMBL3387782)
Ki 69±n/a nM
Citation Chen, JCampbell, APUrmi, KFWakelin, LPDenny, WAGriffith, RFinch, AM Human alpha1-adrenoceptor subtype selectivity of substituted homobivalent 4-aminoquinolines. Bioorg Med Chem22:5910-6 (2014) 
 
Alpha-1A adrenergic receptor
Name:Alpha-1A adrenergic receptor
Type:Cell-surface receptors
Mol. Mass.:51511.67
Organism:Homo sapiens (Human)
Description:P35348
Residue:466
BDBM50103888
NameBDBM50103888
Synonyms:CHEMBL3343978
TypeSmall organic molecule
Emp. Form.C22H22N4O2
Mol. Mass.374.4357
SMILESCOc1ccc2c(NCCNc3ccnc4cc(OC)ccc34)ccnc2c1