Reaction Details
TargetAlpha-1B adrenergic receptor
LigandBDBM50103894
Substrate/Competitorn/a
Meas. Tech.ChEMBL_1436284 (CHEMBL3387784)
Ki 35±n/a nM
Citation Chen, JCampbell, APUrmi, KFWakelin, LPDenny, WAGriffith, RFinch, AM Human alpha1-adrenoceptor subtype selectivity of substituted homobivalent 4-aminoquinolines. Bioorg Med Chem22:5910-6 (2014) 
 
Alpha-1B adrenergic receptor
Name:Alpha-1B adrenergic receptor
Type:Enzyme
Mol. Mass.:56862.13
Organism:Homo sapiens (Human)
Description:P35368
Residue:520
BDBM50103894
NameBDBM50103894
Synonyms:CHEMBL3343983
TypeSmall organic molecule
Emp. Form.C27H32N4O2
Mol. Mass.444.5686
SMILESCOc1ccc2c(NCCCCCCCNc3ccnc4cc(OC)ccc34)ccnc2c1