Reaction Details
TargetAlpha-1B adrenergic receptor
LigandBDBM50103896
Substrate/Competitorn/a
Meas. Tech.ChEMBL_1436285 (CHEMBL3387785)
Ki 28±n/a nM
Citation Chen, JCampbell, APUrmi, KFWakelin, LPDenny, WAGriffith, RFinch, AM Human alpha1-adrenoceptor subtype selectivity of substituted homobivalent 4-aminoquinolines. Bioorg Med Chem22:5910-6 (2014) 
 
Alpha-1B adrenergic receptor
Name:Alpha-1B adrenergic receptor
Type:Enzyme
Mol. Mass.:56862.13
Organism:Homo sapiens (Human)
Description:P35368
Residue:520
BDBM50103896
NameBDBM50103896
Synonyms:CHEMBL3343975
TypeSmall organic molecule
Emp. Form.C20H18N4
Mol. Mass.314.3837
SMILESC(CNc1ccnc2ccccc12)Nc1ccnc2ccccc12