Reaction Details
TargetAlpha-1D adrenergic receptor
LigandBDBM50103894
Substrate/Competitorn/a
Meas. Tech.ChEMBL_1436287 (CHEMBL3387787)
Ki 229±n/a nM
Citation Chen, JCampbell, APUrmi, KFWakelin, LPDenny, WAGriffith, RFinch, AM Human alpha1-adrenoceptor subtype selectivity of substituted homobivalent 4-aminoquinolines. Bioorg Med Chem22:5910-6 (2014) 
 
Alpha-1D adrenergic receptor
Name:Alpha-1D adrenergic receptor
Type:Enzyme Catalytic Domain
Mol. Mass.:60485.82
Organism:Homo sapiens (Human)
Description:adrenergic Alpha1D ADRA1D HUMAN::P25100
Residue:572
BDBM50103894
NameBDBM50103894
Synonyms:CHEMBL3343983
TypeSmall organic molecule
Emp. Form.C27H32N4O2
Mol. Mass.444.5686
SMILESCOc1ccc2c(NCCCCCCCNc3ccnc4cc(OC)ccc34)ccnc2c1