Reaction Details
TargetAlbumin
LigandBDBM79181
Substrate/Competitorn/a
Meas. Tech.ChEMBL_1486769 (CHEMBL3534721)
Kd 14000±n/a nM
Citation Longhi, RCorbioli, SFontana, SVinco, FBraggio, SHelmdach, LSchiller, JBoriss, H Brain tissue binding of drugs: evaluation and validation of solid supported porcine brain membrane vesicles (TRANSIL) as a novel high-throughput method. Drug Metab Dispos39:312-21 (2011) 
 
Albumin
Name:Albumin
Type:PROTEIN
Mol. Mass.:68729.59
Organism:Rattus norvegicus
Description:ChEMBL_1486769
Residue:608
BDBM79181
NameBDBM79181
Synonyms:10-[3-(4-methyl-1-piperazinyl)propyl]-2-(trifluoromethyl)phenothiazine;hydrochloride 10-[3-(4-methylpiperazino)propyl]-2-(trifluoromethyl)phenothiazine;hydrochloride SMR000059133 TRIFLUOPERAZINE DIHYDROCHLORIDE US11542290, Compound Trifluoperazine cid_5566
TypeSmall organic molecule
Emp. Form.C21H24F3N3S
Mol. Mass.407.496
SMILESCN1CCN(CCCN2c3ccccc3Sc3ccc(cc23)C(F)(F)F)CC1