Reaction Details
TargetAmyloid-beta precursor protein
LigandBDBM17747
Substrate/Competitorn/a
Meas. Tech.ChEMBL_1505257 (CHEMBL3594882)
Ki 92±n/a nM
Citation Chu, WZhou, DGaba, VLiu, JLi, SPeng, XXu, JDhavale, DBagchi, DPd'Avignon, AShakerdge, NBBacskai, BJTu, ZKotzbauer, PTMach, RH Design, Synthesis, and Characterization of 3-(Benzylidene)indolin-2-one Derivatives as Ligands fora-Synuclein Fibrils. J Med Chem58:6002-17 (2015) 
 
Amyloid-beta precursor protein
Name:Amyloid-beta precursor protein
Type:Single-pass type I membrane protein
Mol. Mass.:86890.41
Organism:Homo sapiens (Human)
Description:P05067
Residue:770
BDBM17747
NameBDBM17747
Synonyms:(3Z)-3-{[4-(dimethylamino)phenyl]methylidene}-2,3-dihydro-1H-indol-2-one SU 4312 | SU4312
TypeSmall organic molecule
Emp. Form.C17H16N2O
Mol. Mass.264.3217
SMILESCN(C)c1ccc(\C=C2/C(=O)Nc3ccccc23)cc1