Reaction Details
TargetPoly [ADP-ribose] polymerase tankyrase-2
LigandBDBM50104202
Substrate/Competitorn/a
Meas. Tech.ChEMBL_1505392 (CHEMBL3595275)
IC50 64000±n/a nM
Citation Nkizinkiko, YSuneel Kumar, BVJeankumar, VUHaikarainen, TKoivunen, JMadhuri, CYogeeswari, PVenkannagari, HObaji, EPihlajaniemi, TSriram, DLehtiö, L Discovery of potent and selective nonplanar tankyrase inhibiting nicotinamide mimics. Bioorg Med Chem23:4139-49 (2015) 
 
Poly [ADP-ribose] polymerase tankyrase-2
Name:Poly [ADP-ribose] polymerase tankyrase-2
Type:Enzyme
Mol. Mass.:126937.16
Organism:Homo sapiens (Human)
Description:Q9H2K2
Residue:1166
BDBM50104202
NameBDBM50104202
Synonyms:CHEMBL1892778
TypeSmall organic molecule
Emp. Form.C18H23FN4O
Mol. Mass.330.3998
SMILESCCCc1c(C)nc(nc1O)N1CCN(CC1)c1ccccc1F