Reaction Details
TargetProtein mono-ADP-ribosyltransferase PARP4
LigandBDBM50104287
Substrate/Competitorn/a
Meas. Tech.ChEMBL_1505401 (CHEMBL3595284)
IC50>100000±n/a nM
Citation Nkizinkiko, YSuneel Kumar, BVJeankumar, VUHaikarainen, TKoivunen, JMadhuri, CYogeeswari, PVenkannagari, HObaji, EPihlajaniemi, TSriram, DLehtiö, L Discovery of potent and selective nonplanar tankyrase inhibiting nicotinamide mimics. Bioorg Med Chem23:4139-49 (2015) 
 
Protein mono-ADP-ribosyltransferase PARP4
Name:Protein mono-ADP-ribosyltransferase PARP4
Type:n/a
Mol. Mass.:192563.23
Organism:Homo sapiens (Human)
Description:Q9UKK3
Residue:1724
BDBM50104287
NameBDBM50104287
Synonyms:CHEMBL3594136
TypeSmall organic molecule
Emp. Form.C17H18N2O
Mol. Mass.266.3376
SMILESCC(C)c1ccc(cc1)C1NC(=O)c2ccccc2N1