Reaction Details
TargetProtein mono-ADP-ribosyltransferase PARP15
LigandBDBM50104285
Substrate/Competitorn/a
Meas. Tech.ChEMBL_1505402 (CHEMBL3595285)
IC50 17000±n/a nM
Citation Nkizinkiko, YSuneel Kumar, BVJeankumar, VUHaikarainen, TKoivunen, JMadhuri, CYogeeswari, PVenkannagari, HObaji, EPihlajaniemi, TSriram, DLehtiö, L Discovery of potent and selective nonplanar tankyrase inhibiting nicotinamide mimics. Bioorg Med Chem23:4139-49 (2015) 
 
Protein mono-ADP-ribosyltransferase PARP15
Name:Protein mono-ADP-ribosyltransferase PARP15
Type:n/a
Mol. Mass.:74595.89
Organism:Homo sapiens (Human)
Description:Q460N3
Residue:678
BDBM50104285
NameBDBM50104285
Synonyms:CHEMBL3593716
TypeSmall organic molecule
Emp. Form.C13H20N4O
Mol. Mass.248.3241
SMILESCN1CCN(CC1)c1nc2CCCCc2c(=O)[nH]1