Reaction Details
TargetProtein mono-ADP-ribosyltransferase PARP15
LigandBDBM50104287
Substrate/Competitorn/a
Meas. Tech.ChEMBL_1505404 (CHEMBL3595287)
IC50>10000±n/a nM
Citation Nkizinkiko, YSuneel Kumar, BVJeankumar, VUHaikarainen, TKoivunen, JMadhuri, CYogeeswari, PVenkannagari, HObaji, EPihlajaniemi, TSriram, DLehtiö, L Discovery of potent and selective nonplanar tankyrase inhibiting nicotinamide mimics. Bioorg Med Chem23:4139-49 (2015) 
 
Protein mono-ADP-ribosyltransferase PARP15
Name:Protein mono-ADP-ribosyltransferase PARP15
Type:n/a
Mol. Mass.:74595.89
Organism:Homo sapiens (Human)
Description:Q460N3
Residue:678
BDBM50104287
NameBDBM50104287
Synonyms:CHEMBL3594136
TypeSmall organic molecule
Emp. Form.C17H18N2O
Mol. Mass.266.3376
SMILESCC(C)c1ccc(cc1)C1NC(=O)c2ccccc2N1