Reaction Details
TargetPoly [ADP-ribose] polymerase tankyrase-2
LigandBDBM50104317
Substrate/Competitorn/a
Meas. Tech.ChEMBL_1505392 (CHEMBL3595275)
IC50 759±n/a nM
Citation Nkizinkiko, YSuneel Kumar, BVJeankumar, VUHaikarainen, TKoivunen, JMadhuri, CYogeeswari, PVenkannagari, HObaji, EPihlajaniemi, TSriram, DLehtiö, L Discovery of potent and selective nonplanar tankyrase inhibiting nicotinamide mimics. Bioorg Med Chem23:4139-49 (2015) 
 
Poly [ADP-ribose] polymerase tankyrase-2
Name:Poly [ADP-ribose] polymerase tankyrase-2
Type:Enzyme
Mol. Mass.:126937.16
Organism:Homo sapiens (Human)
Description:Q9H2K2
Residue:1166
BDBM50104317
NameBDBM50104317
Synonyms:CHEMBL3594127
TypeSmall organic molecule
Emp. Form.C13H10ClN3O
Mol. Mass.259.691
SMILESClc1ccc(cc1)C1NC(=O)c2cccnc2N1