Reaction Details
TargetPoly [ADP-ribose] polymerase tankyrase-2
LigandBDBM50104294
Substrate/Competitorn/a
Meas. Tech.ChEMBL_1505392 (CHEMBL3595275)
IC50 15136±n/a nM
Citation Nkizinkiko, YSuneel Kumar, BVJeankumar, VUHaikarainen, TKoivunen, JMadhuri, CYogeeswari, PVenkannagari, HObaji, EPihlajaniemi, TSriram, DLehtiö, L Discovery of potent and selective nonplanar tankyrase inhibiting nicotinamide mimics. Bioorg Med Chem23:4139-49 (2015) 
 
Poly [ADP-ribose] polymerase tankyrase-2
Name:Poly [ADP-ribose] polymerase tankyrase-2
Type:Enzyme
Mol. Mass.:126937.16
Organism:Homo sapiens (Human)
Description:Q9H2K2
Residue:1166
BDBM50104294
NameBDBM50104294
Synonyms:CHEMBL3594131
TypeSmall organic molecule
Emp. Form.C14H11FN2O
Mol. Mass.242.2483
SMILESFc1ccccc1C1NC(=O)c2ccccc2N1