Reaction Details
Target3-hydroxy-3-methylglutaryl-coenzyme A reductase
LigandBDBM22164
Substrate/Competitorn/a
Meas. Tech.ChEMBL_1506153 (CHEMBL3594629)
IC50 32100±n/a nM
Citation Wang, KBao, LXiong, WMa, KHan, JWang, WYin, WLiu, H Lanostane Triterpenes from the Tibetan Medicinal Mushroom Ganoderma leucocontextum and Their Inhibitory Effects on HMG-CoA Reductase anda-Glucosidase. J Nat Prod78:1977-89 (2015) 
 
3-hydroxy-3-methylglutaryl-coenzyme A reductase
Name:3-hydroxy-3-methylglutaryl-coenzyme A reductase
Type:PROTEIN
Mol. Mass.:97149.70
Organism:Sus scrofa
Description:ChEMBL_109835
Residue:885
BDBM22164
NameBDBM22164
Synonyms:(3R,5R)-7-[2-(4-fluorophenyl)-3-phenyl-4-(phenylcarbamoyl)-5-(propan-2-yl)-1H-pyrrol-1-yl]-3,5-dihydroxyheptanoic acid Atorvastatin CI 981 US9353061, Atorvastatina
TypeSmall organic molecule
Emp. Form.C33H35FN2O5
Mol. Mass.558.6398
SMILESCC(C)c1c(C(=O)Nc2ccccc2)c(c(-c2ccc(F)cc2)n1CC[C@@H](O)C[C@@H](O)CC(O)=O)-c1ccccc1