Reaction Details
TargetCysteinyl leukotriene receptor 1
LigandBDBM50104839
Substrate/Competitorn/a
Meas. Tech.ChEMBL_1506282 (CHEMBL3599260)
IC50 1.000000±n/a nM
Citation Itadani, SYashiro, KAratani, YSekiguchi, TKinoshita, AMoriguchi, HOhta, NTakahashi, SIshida, ATajima, YHisaichi, KIma, MUeda, JEgashira, HSekioka, TKadode, MYonetomi, YNakao, TInoue, ANomura, HKitamine, TFujita, MNabe, TYamaura, YMatsumura, NImagawa, ANakayama, YTakeuchi, JOhmoto, K Discovery of Gemilukast (ONO-6950), a Dual CysLT1 and CysLT2 Antagonist As a Therapeutic Agent for Asthma. J Med Chem58:6093-113 (2015) 
 
Cysteinyl leukotriene receptor 1
Name:Cysteinyl leukotriene receptor 1
Type:Enzyme Catalytic Domain
Mol. Mass.:38565.16
Organism:Homo sapiens (Human)
Description:Leukotriene Cysteinyl 1 CYSLTR1 HUMAN::Q9Y271
Residue:337
BDBM50104839
NameBDBM50104839
Synonyms:CHEMBL3597525
TypeSmall organic molecule
Emp. Form.C32H30F3NO5
Mol. Mass.565.5795
SMILESOC(=O)CCCc1cn(CC(O)=O)c2c(\C=C\c3ccc(OCCCCc4c(F)ccc(F)c4F)cc3)cccc12