Reaction Details
TargetCysteinyl leukotriene receptor 2
LigandBDBM50104839
Substrate/Competitorn/a
Meas. Tech.ChEMBL_1506283 (CHEMBL3599261)
IC50 2.1±n/a nM
Citation Itadani, SYashiro, KAratani, YSekiguchi, TKinoshita, AMoriguchi, HOhta, NTakahashi, SIshida, ATajima, YHisaichi, KIma, MUeda, JEgashira, HSekioka, TKadode, MYonetomi, YNakao, TInoue, ANomura, HKitamine, TFujita, MNabe, TYamaura, YMatsumura, NImagawa, ANakayama, YTakeuchi, JOhmoto, K Discovery of Gemilukast (ONO-6950), a Dual CysLT1 and CysLT2 Antagonist As a Therapeutic Agent for Asthma. J Med Chem58:6093-113 (2015) 
 
Cysteinyl leukotriene receptor 2
Name:Cysteinyl leukotriene receptor 2
Type:Enzyme Catalytic Domain
Mol. Mass.:39657.52
Organism:Homo sapiens (Human)
Description:Leukotriene Cysteinyl 2 CYSLTR2 HUMAN::Q9NS75
Residue:346
BDBM50104839
NameBDBM50104839
Synonyms:CHEMBL3597525
TypeSmall organic molecule
Emp. Form.C32H30F3NO5
Mol. Mass.565.5795
SMILESOC(=O)CCCc1cn(CC(O)=O)c2c(\C=C\c3ccc(OCCCCc4c(F)ccc(F)c4F)cc3)cccc12