Reaction Details
TargetCysteinyl leukotriene receptor 1
LigandBDBM50104915
Substrate/Competitorn/a
Meas. Tech.ChEMBL_1506309 (CHEMBL3599287)
IC50 3.0±n/a nM
Citation Itadani, SYashiro, KAratani, YSekiguchi, TKinoshita, AMoriguchi, HOhta, NTakahashi, SIshida, ATajima, YHisaichi, KIma, MUeda, JEgashira, HSekioka, TKadode, MYonetomi, YNakao, TInoue, ANomura, HKitamine, TFujita, MNabe, TYamaura, YMatsumura, NImagawa, ANakayama, YTakeuchi, JOhmoto, K Discovery of Gemilukast (ONO-6950), a Dual CysLT1 and CysLT2 Antagonist As a Therapeutic Agent for Asthma. J Med Chem58:6093-113 (2015) 
 
Cysteinyl leukotriene receptor 1
Name:Cysteinyl leukotriene receptor 1
Type:Enzyme Catalytic Domain
Mol. Mass.:39007.58
Organism:GUINEA PIG
Description:Leukotriene D4 0 GUINEA PIG::Q2NNR5
Residue:340
BDBM50104915
NameBDBM50104915
Synonyms:CHEMBL3597628
TypeSmall organic molecule
Emp. Form.C36H37ClFNO5
Mol. Mass.618.134
SMILESCc1c(CCCC(O)=O)c2c(F)ccc(C#Cc3ccc(OCCCCc4cccc(Cl)c4C)cc3)c2n1CCCC(O)=O