Reaction Details
TargetCysteinyl leukotriene receptor 2
LigandBDBM50104920
Substrate/Competitorn/a
Meas. Tech.ChEMBL_1506310 (CHEMBL3599288)
IC50 12±n/a nM
Citation Itadani, SYashiro, KAratani, YSekiguchi, TKinoshita, AMoriguchi, HOhta, NTakahashi, SIshida, ATajima, YHisaichi, KIma, MUeda, JEgashira, HSekioka, TKadode, MYonetomi, YNakao, TInoue, ANomura, HKitamine, TFujita, MNabe, TYamaura, YMatsumura, NImagawa, ANakayama, YTakeuchi, JOhmoto, K Discovery of Gemilukast (ONO-6950), a Dual CysLT1 and CysLT2 Antagonist As a Therapeutic Agent for Asthma. J Med Chem58:6093-113 (2015) 
 
Cysteinyl leukotriene receptor 2
Name:Cysteinyl leukotriene receptor 2
Type:Enzyme Catalytic Domain
Mol. Mass.:36091.77
Organism:GUINEA PIG
Description:Q2NNR4
Residue:317
BDBM50104920
NameBDBM50104920
Synonyms:CHEMBL3597633
TypeSmall organic molecule
Emp. Form.C36H38FNO5
Mol. Mass.583.689
SMILESCc1c(CCCC(O)=O)c2cccc(C#Cc3ccc(OCCCCc4cccc(F)c4C)cc3)c2n1CCCC(O)=O