Reaction Details
Target5-hydroxytryptamine receptor 2A
LigandBDBM50104926
Substrate/Competitorn/a
Meas. Tech.ChEMBL_1506484 (CHEMBL3599950)
Ki 2.4±n/a nM
Citation Boateng, CABakare, OMZhan, JBanala, AKBurzynski, CPommier, EKeck, TMDonthamsetti, PJavitch, JARais, RSlusher, BSXi, ZXNewman, AH High Affinity Dopamine D3 Receptor (D3R)-Selective Antagonists Attenuate Heroin Self-Administration in Wild-Type but not D3R Knockout Mice. J Med Chem58:6195-213 (2015) 
 
5-hydroxytryptamine receptor 2A
Name:5-hydroxytryptamine receptor 2A
Type:undefined
Mol. Mass.:52607.65
Organism:Homo sapiens (Human)
Description:P28223
Residue:471
BDBM50104926
NameBDBM50104926
Synonyms:CHEMBL3597636
TypeSmall organic molecule
Emp. Form.C28H30N4O2
Mol. Mass.454.5634
SMILESOC(CCNC(=O)c1cnc2ccccc2c1)CN1CCN(CC1)c1cccc2ccccc12