Reaction Details
TargetD(2) dopamine receptor
LigandBDBM50104928
Substrate/Competitorn/a
Meas. Tech.ChEMBL_1506474 (CHEMBL3599873)
Ki 72±n/a nM
Citation Boateng, CABakare, OMZhan, JBanala, AKBurzynski, CPommier, EKeck, TMDonthamsetti, PJavitch, JARais, RSlusher, BSXi, ZXNewman, AH High Affinity Dopamine D3 Receptor (D3R)-Selective Antagonists Attenuate Heroin Self-Administration in Wild-Type but not D3R Knockout Mice. J Med Chem58:6195-213 (2015) 
 
D(2) dopamine receptor
Name:D(2) dopamine receptor
Type:Cell-surface receptors
Mol. Mass.:50647.10
Organism:Homo sapiens (Human)
Description:P14416
Residue:443
BDBM50104928
NameBDBM50104928
Synonyms:CHEMBL3597642
TypeSmall organic molecule
Emp. Form.C24H28ClN3O3
Mol. Mass.441.95
SMILESCOc1c(Cl)cccc1N1CCN(CCCCNC(=O)c2cc3ccccc3o2)CC1