Reaction Details
TargetD(2) dopamine receptor
LigandBDBM50105009
Substrate/Competitorn/a
Meas. Tech.ChEMBL_1506474 (CHEMBL3599873)
Ki 8.4±n/a nM
Citation Boateng, CABakare, OMZhan, JBanala, AKBurzynski, CPommier, EKeck, TMDonthamsetti, PJavitch, JARais, RSlusher, BSXi, ZXNewman, AH High Affinity Dopamine D3 Receptor (D3R)-Selective Antagonists Attenuate Heroin Self-Administration in Wild-Type but not D3R Knockout Mice. J Med Chem58:6195-213 (2015) 
 
D(2) dopamine receptor
Name:D(2) dopamine receptor
Type:Cell-surface receptors
Mol. Mass.:50647.10
Organism:Homo sapiens (Human)
Description:P14416
Residue:443
BDBM50105009
NameBDBM50105009
Synonyms:CHEMBL3597645
TypeSmall organic molecule
Emp. Form.C27H29N3OS
Mol. Mass.443.604
SMILESO=C(NCCCCN1CCN(CC1)c1cccc2ccccc12)c1cc2ccccc2s1