Reaction Details
TargetD(2) dopamine receptor
LigandBDBM50129425
Substrate/Competitorn/a
Meas. Tech.ChEMBL_1506474 (CHEMBL3599873)
Ki 37±n/a nM
Citation Boateng, CABakare, OMZhan, JBanala, AKBurzynski, CPommier, EKeck, TMDonthamsetti, PJavitch, JARais, RSlusher, BSXi, ZXNewman, AH High Affinity Dopamine D3 Receptor (D3R)-Selective Antagonists Attenuate Heroin Self-Administration in Wild-Type but not D3R Knockout Mice. J Med Chem58:6195-213 (2015) 
 
D(2) dopamine receptor
Name:D(2) dopamine receptor
Type:Cell-surface receptors
Mol. Mass.:50647.10
Organism:Homo sapiens (Human)
Description:P14416
Residue:443
BDBM50129425
NameBDBM50129425
Synonyms:5-Fluoro-1H-indole-2-carboxylic acid {4-[4-(2,3-dichloro-phenyl)-piperazin-1-yl]-butyl}-amide N-(4-(4-(2,3-dichlorophenyl)piperazin-1-yl)butyl)-5-fluoro-1H-indole-2-carboxamide
TypeSmall organic molecule
Emp. Form.C23H25Cl2FN4O
Mol. Mass.463.375
SMILESFc1ccc2[nH]c(cc2c1)C(=O)NCCCCN1CCN(CC1)c1cccc(Cl)c1Cl