Reaction Details
TargetD(3) dopamine receptor
LigandBDBM50105056
Substrate/Competitorn/a
Meas. Tech.ChEMBL_1506475 (CHEMBL3599874)
Ki 53±n/a nM
Citation Boateng, CABakare, OMZhan, JBanala, AKBurzynski, CPommier, EKeck, TMDonthamsetti, PJavitch, JARais, RSlusher, BSXi, ZXNewman, AH High Affinity Dopamine D3 Receptor (D3R)-Selective Antagonists Attenuate Heroin Self-Administration in Wild-Type but not D3R Knockout Mice. J Med Chem58:6195-213 (2015) 
 
D(3) dopamine receptor
Name:D(3) dopamine receptor
Type:n/a
Mol. Mass.:44243.43
Organism:Homo sapiens (Human)
Description:n/a
Residue:400
BDBM50105056
NameBDBM50105056
Synonyms:CHEMBL3597652
TypeSmall organic molecule
Emp. Form.C26H32N4O3
Mol. Mass.448.5573
SMILESCOc1ccccc1N1CCN(CC(O)CCNC(=O)c2cnc3ccc(C)cc3c2)CC1