Reaction Details
TargetEndothelial PAS domain-containing protein 1
LigandBDBM50105280
Substrate/Competitorn/a
Meas. Tech.ChEMBL_1506506 (CHEMBL3599972)
IC50 87±n/a nM
Citation Scheuermann, THStroud, DSleet, CEBayeh, LShokri, CWang, HCaldwell, CGLonggood, JMacMillan, JBBruick, RKGardner, KHTambar, UK Isoform-Selective and Stereoselective Inhibition of Hypoxia Inducible Factor-2. J Med Chem58:5930-41 (2015) 
 
Endothelial PAS domain-containing protein 1
Name:Endothelial PAS domain-containing protein 1
Type:PROTEIN
Mol. Mass.:96453.58
Organism:Homo sapiens (Human)
Description:ChEMBL_1506501
Residue:870
BDBM50105280
NameBDBM50105280
Synonyms:CHEMBL3597780
TypeSmall organic molecule
Emp. Form.C16H12Br2ClN5
Mol. Mass.469.561
SMILESClc1ccc(Br)cc1[C@H]1C[C@H](Nc2nnnn12)c1cccc(Br)c1