Reaction Details
TargetEndothelial PAS domain-containing protein 1
LigandBDBM50105310
Substrate/Competitorn/a
Meas. Tech.ChEMBL_1506507 (CHEMBL3599973)
IC50<1000±n/a nM
Citation Scheuermann, THStroud, DSleet, CEBayeh, LShokri, CWang, HCaldwell, CGLonggood, JMacMillan, JBBruick, RKGardner, KHTambar, UK Isoform-Selective and Stereoselective Inhibition of Hypoxia Inducible Factor-2. J Med Chem58:5930-41 (2015) 
 
Endothelial PAS domain-containing protein 1
Name:Endothelial PAS domain-containing protein 1
Type:PROTEIN
Mol. Mass.:96453.58
Organism:Homo sapiens (Human)
Description:ChEMBL_1506501
Residue:870
BDBM50105310
NameBDBM50105310
Synonyms:CHEMBL3597786
TypeSmall organic molecule
Emp. Form.C16H12Br2FN5
Mol. Mass.453.106
SMILESFc1cc(Br)cc(c1)[C@@H]1C[C@H](c2cccc(Br)c2)n2nnnc2N1