Reaction Details
TargetHistone deacetylase 5
LigandBDBM50105329
Substrate/Competitorn/a
Meas. Tech.ChEMBL_1506758 (CHEMBL3598917)
Ki 600±n/a nM
Citation Carrillo, AKGuiguemde, WAGuy, RK Evaluation of histone deacetylase inhibitors (HDACi) as therapeutic leads for human African trypanosomiasis (HAT). Bioorg Med Chem23:5151-5 (2015) 
 
Histone deacetylase 5
Name:Histone deacetylase 5
Type:Enzyme
Mol. Mass.:121968.61
Organism:Homo sapiens (Human)
Description:Q9UQL6
Residue:1122
BDBM50105329
NameBDBM50105329
Synonyms:CHEMBL1213492
TypeSmall organic molecule
Emp. Form.C24H27N3O4
Mol. Mass.421.4889
SMILESCCN(CC)Cc1ccc2cc(COC(=O)Nc3ccc(cc3)C(=O)NO)ccc2c1