Reaction Details
TargetPolyamine deacetylase HDAC10
LigandBDBM24622
Substrate/Competitorn/a
Meas. Tech.ChEMBL_1506762 (CHEMBL3598921)
Ki 24±n/a nM
Citation Carrillo, AKGuiguemde, WAGuy, RK Evaluation of histone deacetylase inhibitors (HDACi) as therapeutic leads for human African trypanosomiasis (HAT). Bioorg Med Chem23:5151-5 (2015) 
 
Polyamine deacetylase HDAC10
Name:Polyamine deacetylase HDAC10
Type:Chromatin regulator; hydrolase; repressor
Mol. Mass.:71431.89
Organism:Homo sapiens (Human)
Description:Q969S8
Residue:669
BDBM24622
NameBDBM24622
Synonyms:3-[(dimethylamino)methyl]-N-{2-[4-(hydroxycarbamoyl)phenoxy]ethyl}-1-benzofuran-2-carboxamide | CRA-024781
TypeSmall organic molecule
Emp. Form.C21H23N3O5
Mol. Mass.397.4244
SMILESCN(C)Cc1c(oc2ccccc12)C(=O)NCCOc1ccc(cc1)C(=O)NO