Reaction Details
TargetHistone deacetylase 11
LigandBDBM50105330
Substrate/Competitorn/a
Meas. Tech.ChEMBL_1506763 (CHEMBL3598922)
Ki 43±n/a nM
Citation Carrillo, AKGuiguemde, WAGuy, RK Evaluation of histone deacetylase inhibitors (HDACi) as therapeutic leads for human African trypanosomiasis (HAT). Bioorg Med Chem23:5151-5 (2015) 
 
Histone deacetylase 11
Name:Histone deacetylase 11
Type:Chromatin regulator; hydrolase; repressor
Mol. Mass.:39187.66
Organism:Homo sapiens (Human)
Description:Q96DB2
Residue:347
BDBM50105330
NameBDBM50105330
Synonyms:CHEMBL1851943
TypeSmall organic molecule
Emp. Form.C20H30N4O2
Mol. Mass.358.4778
SMILESCCCCc1nc2cc(\C=C\C(=O)NO)ccc2n1CCN(CC)CC