Reaction Details
TargetPolyamine deacetylase HDAC10
LigandBDBM22449
Substrate/Competitorn/a
Meas. Tech.ChEMBL_1506762 (CHEMBL3598921)
Ki 374±n/a nM
Citation Carrillo, AKGuiguemde, WAGuy, RK Evaluation of histone deacetylase inhibitors (HDACi) as therapeutic leads for human African trypanosomiasis (HAT). Bioorg Med Chem23:5151-5 (2015) 
 
Polyamine deacetylase HDAC10
Name:Polyamine deacetylase HDAC10
Type:Chromatin regulator; hydrolase; repressor
Mol. Mass.:71431.89
Organism:Homo sapiens (Human)
Description:Q969S8
Residue:669
BDBM22449
NameBDBM22449
Synonyms:CHEMBL356769 Tubacin | US9249087, Tubastatin A
TypeSmall organic molecule
Emp. Form.C41H43N3O7S
Mol. Mass.721.861
SMILESOCc1ccc(cc1)[C@@H]1C[C@H](CSc2nc(c(o2)-c2ccccc2)-c2ccccc2)O[C@@H](O1)c1ccc(NC(=O)CCCCCCC(=O)NO)cc1