Reaction Details
TargetAminopeptidase N
LigandBDBM50105723
Substrate/Competitorn/a
Meas. Tech.ChEMBL_1507527 (CHEMBL3599783)
Ki 6.0±n/a nM
Citation Revelant, GAl-Lakkis-Wehbe, MSchmitt, MAlavi, SSchmitt, CRoux, LAl-Masri, MSchifano-Faux, NMaiereanu, CTarnus, CAlbrecht, S Exploring S1 plasticity and probing S1' subsite of mammalian aminopeptidase N/CD13 with highly potent and selective aminobenzosuberone inhibitors. Bioorg Med Chem23:3192-207 (2015) 
 
Aminopeptidase N
Name:Aminopeptidase N
Type:Protein
Mol. Mass.:108810.25
Organism:Sus scrofa (Pig)
Description:P15145
Residue:963
BDBM50105723
NameBDBM50105723
Synonyms:CHEMBL3597460
TypeSmall organic molecule
Emp. Form.C16H16ClFN2O
Mol. Mass.306.762
SMILESCl.NC1CCc2cccc(c2CC1=O)-c1ccncc1F