Reaction Details
TargetAcetylcholinesterase
LigandBDBM8961
Substrate/Competitorn/a
Meas. Tech.ChEMBL_1507558 (CHEMBL3599814)
IC50 300±n/a nM
Citation Rampa, AMancini, FDe Simone, AFalchi, FBelluti, FDi Martino, RMGobbi, SAndrisano, VTarozzi, ABartolini, MCavalli, ABisi, A From AChE to BACE1 inhibitors: The role of the amine on the indanone scaffold. Bioorg Med Chem Lett25:2804-8 (2015) 
 
Acetylcholinesterase
Name:Acetylcholinesterase
Type:Enzyme
Mol. Mass.:67792.70
Organism:Homo sapiens (Human)
Description:P22303
Residue:614
BDBM8961
NameBDBM8961
Synonyms:1,2,3,4-tetrahydro-9-acridinamine 9-THA CHEMBL1337960 Cognex Tracine cid_1935 | tacrine.HCl
TypeSmall organic molecule
Emp. Form.C13H14N2
Mol. Mass.198.2637
SMILESNc1c2CCCCc2nc2ccccc12