Reaction Details
TargetMetabotropic glutamate receptor 1
LigandBDBM50105831
Substrate/Competitorn/a
Meas. Tech.ChEMBL_1507634 (CHEMBL3600045)
IC50 271±n/a nM
Citation Anighoro, AGraziani, DBettinelli, ICilia, ADe Toma, CLonghi, MMangiarotti, FMenegon, SPirona, LPoggesi, ERiva, CRastelli, G Insights into the interaction of negative allosteric modulators with the metabotropic glutamate receptor 5: discovery and computational modeling of a new series of ligands with nanomolar affinity. Bioorg Med Chem23:3040-58 (2015) 
 
Metabotropic glutamate receptor 1
Name:Metabotropic glutamate receptor 1
Type:Enzyme Catalytic Domain
Mol. Mass.:133240.47
Organism:RAT
Description:metabotropic glutamate 1/2 0 RAT::P23385
Residue:1199
BDBM50105831
NameBDBM50105831
Synonyms:CHEMBL3597584
TypeSmall organic molecule
Emp. Form.C18H16N4O3
Mol. Mass.336.3446
SMILES[O-][N+](=O)c1cccnc1N1CCN(CC1)C(=O)C#Cc1ccccc1