Reaction Details
TargetMetabotropic glutamate receptor 1
LigandBDBM50105801
Substrate/Competitorn/a
Meas. Tech.ChEMBL_1507634 (CHEMBL3600045)
IC50 551±n/a nM
Citation Anighoro, AGraziani, DBettinelli, ICilia, ADe Toma, CLonghi, MMangiarotti, FMenegon, SPirona, LPoggesi, ERiva, CRastelli, G Insights into the interaction of negative allosteric modulators with the metabotropic glutamate receptor 5: discovery and computational modeling of a new series of ligands with nanomolar affinity. Bioorg Med Chem23:3040-58 (2015) 
 
Metabotropic glutamate receptor 1
Name:Metabotropic glutamate receptor 1
Type:Enzyme Catalytic Domain
Mol. Mass.:133240.47
Organism:RAT
Description:metabotropic glutamate 1/2 0 RAT::P23385
Residue:1199
BDBM50105801
NameBDBM50105801
Synonyms:CHEMBL3597596
TypeSmall organic molecule
Emp. Form.C20H19N3O2
Mol. Mass.333.3838
SMILES[#6]-c1cccc(n1)C#C\[#6]=[#6]-1/[#6]-[#6]-[#7](-[#6]-[#6]-1)-c1ccccc1-[#7+](-[#8-])=O