Reaction Details
TargetMetabotropic glutamate receptor 5
LigandBDBM50105805
Substrate/Competitorn/a
Meas. Tech.ChEMBL_1507571 (CHEMBL3599913)
Ki 0.400000±n/a nM
Citation Anighoro, AGraziani, DBettinelli, ICilia, ADe Toma, CLonghi, MMangiarotti, FMenegon, SPirona, LPoggesi, ERiva, CRastelli, G Insights into the interaction of negative allosteric modulators with the metabotropic glutamate receptor 5: discovery and computational modeling of a new series of ligands with nanomolar affinity. Bioorg Med Chem23:3040-58 (2015) 
 
Metabotropic glutamate receptor 5
Name:Metabotropic glutamate receptor 5
Type:Enzyme
Mol. Mass.:131900.14
Organism:Rattus norvegicus (Rat)
Description:P31424
Residue:1203
BDBM50105805
NameBDBM50105805
Synonyms:CHEMBL3597600
TypeSmall organic molecule
Emp. Form.C20H17N5O2
Mol. Mass.359.3813
SMILES[#6]-c1ccc(c(n1)-[#7]-1-[#6]-[#6]\[#6](-[#6]-[#6]-1)=[#6]/C#Cc1ccc(cn1)C#N)-[#7+](-[#8-])=O