Reaction Details
TargetMetabotropic glutamate receptor 5
LigandBDBM50149805
Substrate/Competitorn/a
Meas. Tech.ChEMBL_1507571 (CHEMBL3599913)
Ki 11±n/a nM
Citation Anighoro, AGraziani, DBettinelli, ICilia, ADe Toma, CLonghi, MMangiarotti, FMenegon, SPirona, LPoggesi, ERiva, CRastelli, G Insights into the interaction of negative allosteric modulators with the metabotropic glutamate receptor 5: discovery and computational modeling of a new series of ligands with nanomolar affinity. Bioorg Med Chem23:3040-58 (2015) 
 
Metabotropic glutamate receptor 5
Name:Metabotropic glutamate receptor 5
Type:Enzyme
Mol. Mass.:131900.14
Organism:Rattus norvegicus (Rat)
Description:P31424
Residue:1203
BDBM50149805
NameBDBM50149805
Synonyms:2-(Pyridin-3-yl)-5-(2-methylthiazol-4ylethynyl)pyridine CHEMBL369310
TypeSmall organic molecule
Emp. Form.C16H11N3S
Mol. Mass.277.344
SMILESCc1nc(cs1)C#Cc1ccc(nc1)-c1cccnc1