Reaction Details
TargetMetabotropic glutamate receptor 5
LigandBDBM50149805
Substrate/Competitorn/a
Meas. Tech.ChEMBL_1507573 (CHEMBL3599915)
IC50 6.1±n/a nM
Citation Anighoro, AGraziani, DBettinelli, ICilia, ADe Toma, CLonghi, MMangiarotti, FMenegon, SPirona, LPoggesi, ERiva, CRastelli, G Insights into the interaction of negative allosteric modulators with the metabotropic glutamate receptor 5: discovery and computational modeling of a new series of ligands with nanomolar affinity. Bioorg Med Chem23:3040-58 (2015) 
 
Metabotropic glutamate receptor 5
Name:Metabotropic glutamate receptor 5
Type:Enzyme
Mol. Mass.:132484.72
Organism:Homo sapiens (Human)
Description:n/a
Residue:1212
BDBM50149805
NameBDBM50149805
Synonyms:2-(Pyridin-3-yl)-5-(2-methylthiazol-4ylethynyl)pyridine CHEMBL369310
TypeSmall organic molecule
Emp. Form.C16H11N3S
Mol. Mass.277.344
SMILESCc1nc(cs1)C#Cc1ccc(nc1)-c1cccnc1