Reaction Details
TargetPolyunsaturated fatty acid lipoxygenase ALOX15
LigandBDBM50105870
Substrate/Competitorn/a
Meas. Tech.ChEMBL_1507783 (CHEMBL3598540)
IC50 17±n/a nM
Citation Pelcman, BSanin, ANilsson, PSchaal, WOlofsson, KKrog-Jensen, CForsell, PHallberg, ALarhed, MBoesen, TKromann, HClaesson, HE N-Substituted pyrazole-3-carboxamides as inhibitors of human 15-lipoxygenase. Bioorg Med Chem Lett25:3017-23 (2015) 
 
Polyunsaturated fatty acid lipoxygenase ALOX15
Name:Polyunsaturated fatty acid lipoxygenase ALOX15
Type:Protein
Mol. Mass.:74804.05
Organism:Homo sapiens (Human)
Description:n/a
Residue:662
BDBM50105870
NameBDBM50105870
Synonyms:CHEMBL3597768
TypeSmall organic molecule
Emp. Form.C18H12ClFN4O3S
Mol. Mass.418.829
SMILESFc1ccc(NC(=O)c2ccn(n2)C(=S)Nc2ccc3OCOc3c2)c(Cl)c1