Reaction Details
TargetCystic fibrosis transmembrane conductance regulator
LigandBDBM50108513
Substrate/Competitorn/a
Meas. Tech.ChEMBL_1507807 (CHEMBL3598671)
EC50 5300±n/a nM
Citation Pesce, EBellotti, MLiessi, NGuariento, SDamonte, GCichero, EGalatini, ASalis, AGianotti, APedemonte, NZegarra-Moran, OFossa, PGalietta, LJMillo, E Synthesis and structure-activity relationship of aminoarylthiazole derivatives as correctors of the chloride transport defect in cystic fibrosis. Eur J Med Chem99:14-35 (2015) 
 
Cystic fibrosis transmembrane conductance regulator
Name:Cystic fibrosis transmembrane conductance regulator
Type:Enzyme Catalytic Domain
Mol. Mass.:168171.30
Organism:Homo sapiens (Human)
Description:gi_90421313
Residue:1480
BDBM50108513
NameBDBM50108513
Synonyms:CHEMBL3597853
TypeSmall organic molecule
Emp. Form.C16H13ClN2S2
Mol. Mass.332.871
SMILESCSc1cccc(Nc2nc(cs2)-c2cccc(Cl)c2)c1