Reaction Details
TargetCystic fibrosis transmembrane conductance regulator
LigandBDBM50105909
Substrate/Competitorn/a
Meas. Tech.ChEMBL_1507794 (CHEMBL3598551)
EC50 15000±n/a nM
Citation Pesce, EBellotti, MLiessi, NGuariento, SDamonte, GCichero, EGalatini, ASalis, AGianotti, APedemonte, NZegarra-Moran, OFossa, PGalietta, LJMillo, E Synthesis and structure-activity relationship of aminoarylthiazole derivatives as correctors of the chloride transport defect in cystic fibrosis. Eur J Med Chem99:14-35 (2015) 
 
Cystic fibrosis transmembrane conductance regulator
Name:Cystic fibrosis transmembrane conductance regulator
Type:Enzyme Catalytic Domain
Mol. Mass.:168171.30
Organism:Homo sapiens (Human)
Description:gi_90421313
Residue:1480
BDBM50105909
NameBDBM50105909
Synonyms:CHEMBL3597937
TypeSmall organic molecule
Emp. Form.C14H11ClN2S3
Mol. Mass.338.899
SMILESCSc1cccc(Nc2nc(cs2)-c2cc(Cl)cs2)c1