Reaction Details
TargetDual specificity tyrosine-phosphorylation-regulated kinase 3
LigandBDBM50105912
Substrate/Competitorn/a
Meas. Tech.ChEMBL_1508026 (CHEMBL3599516)
IC50 2200±n/a nM
Citation Yadav, RRSharma, SJoshi, PWani, AVishwakarma, RAKumar, ABharate, SB Meridianin derivatives as potent Dyrk1A inhibitors and neuroprotective agents. Bioorg Med Chem Lett25:2948-52 (2015) 
 
Dual specificity tyrosine-phosphorylation-regulated kinase 3
Name:Dual specificity tyrosine-phosphorylation-regulated kinase 3
Type:PROTEIN
Mol. Mass.:65747.26
Organism:Homo sapiens (Human)
Description:ChEMBL_1508026
Residue:588
BDBM50105912
NameBDBM50105912
Synonyms:CHEMBL3133762
TypeSmall organic molecule
Emp. Form.C17H16BrN5O2
Mol. Mass.402.245
SMILESNc1nccc(n1)-c1cn(C(=O)N2CCOCC2)c2ccc(Br)cc12