Reaction Details
TargetDelta-type opioid receptor
LigandBDBM50106344
Substrate/Competitorn/a
Meas. Tech.ChEMBL_1506602 (CHEMBL3598355)
EC50 220±n/a nM
Citation Nemoto, TIihara, YHirayama, SIwai, THigashi, EFujii, HNagase, H Naltrindole derivatives with fluorinated ethyl substituents on the 17-nitrogen asd opioid receptor inverse agonists. Bioorg Med Chem Lett25:2927-30 (2015) 
 
Delta-type opioid receptor
Name:Delta-type opioid receptor
Type:G Protein-Coupled Receptor (GPCR)
Mol. Mass.:40382.98
Organism:Homo sapiens (Human)
Description:Competition binding assays were carried out using membrane preparations from transfected HN9.10 cells that constitutively expressed the delta opioid receptor.
Residue:372
BDBM50106344
NameBDBM50106344
Synonyms:CHEMBL3596365
TypeSmall organic molecule
Emp. Form.C24H24ClFN2O3
Mol. Mass.442.91
SMILESCl.[H][C@@]12Oc3c4c(C[C@@]5([H])N(CCF)CC[C@@]14[C@@]5(O)Cc1c2[nH]c2ccccc12)ccc3O