Reaction Details
TargetKappa-type opioid receptor
LigandBDBM50106352
Substrate/Competitorn/a
Meas. Tech.ChEMBL_1506599 (CHEMBL3598352)
Ki 74±n/a nM
Citation Nemoto, TIihara, YHirayama, SIwai, THigashi, EFujii, HNagase, H Naltrindole derivatives with fluorinated ethyl substituents on the 17-nitrogen asd opioid receptor inverse agonists. Bioorg Med Chem Lett25:2927-30 (2015) 
 
Kappa-type opioid receptor
Name:Kappa-type opioid receptor
Type:G Protein-Coupled Receptor (GPCR)
Mol. Mass.:42648.76
Organism:Homo sapiens (Human)
Description:P41145
Residue:380
BDBM50106352
NameBDBM50106352
Synonyms:CHEMBL3596364
TypeSmall organic molecule
Emp. Form.C25H27ClN2O3
Mol. Mass.438.946
SMILESCl.[H][C@@]12Oc3c4c(C[C@@]5([H])N(CCC)CC[C@@]14[C@@]5(O)Cc1c2[nH]c2ccccc12)ccc3O