Reaction Details
TargetMu-type opioid receptor
LigandBDBM50106350
Substrate/Competitorn/a
Meas. Tech.ChEMBL_1506597 (CHEMBL3598350)
Ki 123±n/a nM
Citation Nemoto, TIihara, YHirayama, SIwai, THigashi, EFujii, HNagase, H Naltrindole derivatives with fluorinated ethyl substituents on the 17-nitrogen asd opioid receptor inverse agonists. Bioorg Med Chem Lett25:2927-30 (2015) 
 
Mu-type opioid receptor
Name:Mu-type opioid receptor
Type:G Protein-Coupled Receptor (GPCR)
Mol. Mass.:44789.51
Organism:Homo sapiens (Human)
Description:P35372
Residue:400
BDBM50106350
NameBDBM50106350
Synonyms:CHEMBL3596369
TypeSmall organic molecule
Emp. Form.C26H27ClN2O3
Mol. Mass.450.957
SMILESCl.[H][C@@]12Oc3c4c(C[C@@]5([H])N(CCC)CC[C@@]14[C@@]5(O)Cc1cc4ccccc4nc21)ccc3O