Reaction Details
TargetMu-type opioid receptor
LigandBDBM50106344
Substrate/Competitorn/a
Meas. Tech.ChEMBL_1506597 (CHEMBL3598350)
Ki 675±n/a nM
Citation Nemoto, TIihara, YHirayama, SIwai, THigashi, EFujii, HNagase, H Naltrindole derivatives with fluorinated ethyl substituents on the 17-nitrogen asd opioid receptor inverse agonists. Bioorg Med Chem Lett25:2927-30 (2015) 
 
Mu-type opioid receptor
Name:Mu-type opioid receptor
Type:G Protein-Coupled Receptor (GPCR)
Mol. Mass.:44789.51
Organism:Homo sapiens (Human)
Description:P35372
Residue:400
BDBM50106344
NameBDBM50106344
Synonyms:CHEMBL3596365
TypeSmall organic molecule
Emp. Form.C24H24ClFN2O3
Mol. Mass.442.91
SMILESCl.[H][C@@]12Oc3c4c(C[C@@]5([H])N(CCF)CC[C@@]14[C@@]5(O)Cc1c2[nH]c2ccccc12)ccc3O