Reaction Details
TargetSubstance-P receptor
LigandBDBM50108639
Substrate/Competitorn/a
Meas. Tech.ChEMBL_1506611 (CHEMBL3598468)
IC50 0.030000±n/a nM
Citation Degnan, APTora, GOHan, YRajamani, RBertekap, RKrause, RDavis, CDHu, JMorgan, DTaylor, SJKrause, KLi, YWMattson, GCunningham, MATaber, MTLodge, NJBronson, JJGillman, KWMacor, JE Biaryls as potent, tunable dual neurokinin 1 receptor antagonists and serotonin transporter inhibitors. Bioorg Med Chem Lett25:3039-43 (2015) 
 
Substance-P receptor
Name:Substance-P receptor
Type:G Protein-Coupled Receptor (GPCR)
Mol. Mass.:46371.54
Organism:Rattus norvegicus (rat)
Description:Competition binding assays were carried out using membrane preparations from transfected CHO cells that constitutively expressed the rat NK1 receptor.
Residue:407
BDBM50108639
NameBDBM50108639
Synonyms:CHEMBL3596448
TypeSmall organic molecule
Emp. Form.C21H22F3N5O2
Mol. Mass.433.4269
SMILESCOc1ccc(cc1CO[C@H]1CCCN[C@H]1c1ccccc1)-n1nnnc1C(F)(F)F